{"text_format":"1","workbook":"xlsx","n_sheets":5,"sheets":["SD issue","RR diagram","3-D RR","LT 24-h paterns","TH 24-h paterns"],"not_rendered":{"charts":3,"images":1,"macros":1,"external_links":0,"defined_names":0,"comments":0,"pivot_tables":0},"unopened":[],"bounds":{"document_bytes":16777216,"sheet_cells":100000,"rows_first":2000,"rows_last":500,"rows_between":2000,"halvings":0,"cell_chars":16384,"cell_head_chars":4096},"cells_cut":0,"cells_raw":0,"read":"whole","date_system":"1900"}

{"sheet":"SD issue","index":0,"n_rows":25,"n_cols":17,"rows_kept":25,"cut":false,"hidden":false,"merged":[[22,0,22,14],[21,0,21,13],[2,0,2,1],[20,0,20,11]]}
["Is there any opposing LT movement? (Y/N):",null,null,null,"Y",null,"If the answer is no, there is no SD problem"]
[]
["Input"]
["# opposing lanes 1",2]
["Opposing speed limit (mph)",40,null,null,null,null,null,null,null,null,null,null,null,null,null,"Required SD (ft):",{"$f":"B5*0.44704*(5.5+0.5*(B4-1))*3.281","v":352.01717759999997}]
["LT offset X0 (ft)",-8]
["Intersection Length, L (ft)",100]
["OTHLW (ft)",12]
["OLTLW (ft)",13]
["Yi (ft) 2",0]
["Vw (ft)",7]
["lateral position of OLT vehicle xl (ft) 3",1.5]
["xi (ft) 4",3.5,null,null,null,null,null,null,null,null,null,null,null,null,null,"Available SD (ft):",{"$f":"IF(B17>0,B15+B15*(B16+B8/2)/B17,1500)","v":230}]
[]
["Ya (ft)",{"$f":"B7-2*B10-8","v":92}]
{"$rows_left_out":11}
{"sheet":"RR diagram","index":1,"n_rows":17,"n_cols":25,"rows_kept":17,"cut":false,"hidden":false,"merged":[[1,0,1,1],[1,3,1,4],[0,0,0,24],[9,0,9,24]]}
[{"$f":"\"Protected/Permited left turn phasing, Speed limit \"&IF('SD issue'!B5< 45,\"<45\",\"≥45\")&\" mph, \"&IF('SD issue'!P22=\"SD Problem\",\"Sight Distance Problem\",\"No Sight Distance Problem\")","v":"Protected/Permited left turn phasing, Speed limit <45 mph, Sight Distance Problem"}]
["Model Parameters",null,null,"Base Condition",null,null,{"$f":"IFERROR(B3,\"Attention: The research was inconclusive for this approach type. This spreadsheet tool cannot be used\")","v":0.33}]
["beta 1:",{"$f":"HLOOKUP('3-D RR'!$A$4,'3-D RR'!$D$2:$F$4,2,FALSE)","v":0.33},null,"LT vol",100]
["beta 2:",{"$f":"HLOOKUP('3-D RR'!$A$4,'3-D RR'!$D$2:$F$4,3,FALSE)","v":0.64},null,"Opp vol",500]
[]
["Sampled hours",1,2,3,4,5,6,7,8,9,10,11,12,13,14,15,16,17,18,19,20,21,22,23,24]
["LT vol",null,null,null,null,null,null,90,201,123,null,null,74,93,null,null,73,97,100]
["Opp vol",null,null,null,null,null,null,254,435,451,null,null,494,540,null,null,991,1017,1012]
[]
["Estimated 24-hour turning movement volumes"]
["LT vol",2.1648591500367451,8.8081196666676756E-2,1.0582140425211468,0.91608099762965756,4.240723472613964,21.063731082330758,90,201,123,59.965765302745879,47.133477566645574,74,93,72.496644450527398,59.274446454020278,73,97,100,51.294403914174922,30.484594893811668,27.345555877361011,16.923244151184011,8.8292194891270359,4.332614774917845]
["LT st. deviation",1.544372476612843,0.31174685681760333,1.6347034341364639,0.96214714041012295,2.1733662109586507,5.1156896538247443,0,0,0,10.037554247709872,8.5399339822661897,0,0,12.502567909072594,11.111147697720344,0,0,0,9.027680043917421,6.5565482548218093,8.8991941967967048,4.7377756337339463,3.1737642614288895,2.2799016731911586]
["Opp vol",37.880524053703667,26.187917145078938,12.176986157776849,16.372303928848503,47.737077409818774,147.38604285720558,254,435,451,412.23087837285613,401.03031749800908,494,540,558.61512069668242,596.15674865871142,991,1017,1012,606.29567164444165,291.13535754942632,329.81213117093893,188.68476635450344,159.02354607827846,82.778929260595859]
["Opp st. deviation",10.491837294990058,7.7912571224222393,4.4375072803073943,5.4621504403163446,12.75250099166032,35.184733798625501,0,0,0,94.570293692571241,92.066589761014214,0,0,127.38320170645322,135.7980747125012,0,0,0,138.0718339854233,67.465849022973899,76.103183750150862,44.530929377366043,37.816027802474899,20.688115427015862]
[]
{"$rows_left_out":3}
{"sheet":"3-D RR","index":2,"n_rows":22,"n_cols":13,"rows_kept":22,"cut":false,"hidden":false,"merged":[]}
[]
[{"$f":"IF('SD issue'!B5<45,\"LowSp\",\"HighSp\")","v":"LowSp"},null,null,"LowSp noSD","LowSp SD","HighSp SD"]
[{"$f":"IF('SD issue'!P22=\"SD Problem\",\"SD\",\"noSD\")","v":"SD"},null,"beta 1",0.38,0.33,0.45]
[{"$f":"A2&\" \"&A3","v":"LowSp SD"},null,"beta 2",0.37,0.64,0.53]
[]
[null,"RR",0,50,100,150,200,250,300,350,400,450,500]
[null,0,{"$f":"(C$6/'RR diagram'!$E$3)^'RR diagram'!$B$3*($B7/'RR diagram'!$E$4)^'RR diagram'!$B$4","v":0},{"$f":"(D$6/'RR diagram'!$E$3)^'RR diagram'!$B$3*($B7/'RR diagram'!$E$4)^'RR diagram'!$B$4","v":0},{"$f":"(E$6/'RR diagram'!$E$3)^'RR diagram'!$B$3*($B7/'RR diagram'!$E$4)^'RR diagram'!$B$4","v":0},{"$f":"(F$6/'RR diagram'!$E$3)^'RR diagram'!$B$3*($B7/'RR diagram'!$E$4)^'RR diagram'!$B$4","v":0},{"$f":"(G$6/'RR diagram'!$E$3)^'RR diagram'!$B$3*($B7/'RR diagram'!$E$4)^'RR diagram'!$B$4","v":0},{"$f":"(H$6/'RR diagram'!$E$3)^'RR diagram'!$B$3*($B7/'RR diagram'!$E$4)^'RR diagram'!$B$4","v":0},{"$f":"(I$6/'RR diagram'!$E$3)^'RR diagram'!$B$3*($B7/'RR diagram'!$E$4)^'RR diagram'!$B$4","v":0},{"$f":"(J$6/'RR diagram'!$E$3)^'RR diagram'!$B$3*($B7/'RR diagram'!$E$4)^'RR diagram'!$B$4","v":0},{"$f":"(K$6/'RR diagram'!$E$3)^'RR diagram'!$B$3*($B7/'RR diagram'!$E$4)^'RR diagram'!$B$4","v":0},{"$f":"(L$6/'RR diagram'!$E$3)^'RR diagram'!$B$3*($B7/'RR diagram'!$E$4)^'RR diagram'!$B$4","v":0},{"$f":"(M$6/'RR diagram'!$E$3)^'RR diagram'!$B$3*($B7/'RR diagram'!$E$4)^'RR diagram'!$B$4","v":0}]
[null,100,{"$f":"(C$6/'RR diagram'!$E$3)^'RR diagram'!$B$3*($B8/'RR diagram'!$E$4)^'RR diagram'!$B$4","v":0},{"$f":"(D$6/'RR diagram'!$E$3)^'RR diagram'!$B$3*($B8/'RR diagram'!$E$4)^'RR diagram'!$B$4","v":0.28400062686773614},{"$f":"(E$6/'RR diagram'!$E$3)^'RR diagram'!$B$3*($B8/'RR diagram'!$E$4)^'RR diagram'!$B$4","v":0.3569925863453276},{"$f":"(F$6/'RR diagram'!$E$3)^'RR diagram'!$B$3*($B8/'RR diagram'!$E$4)^'RR diagram'!$B$4","v":0.40810255401542556},{"$f":"(G$6/'RR diagram'!$E$3)^'RR diagram'!$B$3*($B8/'RR diagram'!$E$4)^'RR diagram'!$B$4","v":0.44874445564121546},{"$f":"(H$6/'RR diagram'!$E$3)^'RR diagram'!$B$3*($B8/'RR diagram'!$E$4)^'RR diagram'!$B$4","v":0.48303588962930716},{"$f":"(I$6/'RR diagram'!$E$3)^'RR diagram'!$B$3*($B8/'RR diagram'!$E$4)^'RR diagram'!$B$4","v":0.51299036857390679},{"$f":"(J$6/'RR diagram'!$E$3)^'RR diagram'!$B$3*($B8/'RR diagram'!$E$4)^'RR diagram'!$B$4","v":0.53976118656036198},{"$f":"(K$6/'RR diagram'!$E$3)^'RR diagram'!$B$3*($B8/'RR diagram'!$E$4)^'RR diagram'!$B$4","v":0.56407778248352514},{"$f":"(L$6/'RR diagram'!$E$3)^'RR diagram'!$B$3*($B8/'RR diagram'!$E$4)^'RR diagram'!$B$4","v":0.58643424991972781},{"$f":"(M$6/'RR diagram'!$E$3)^'RR diagram'!$B$3*($B8/'RR diagram'!$E$4)^'RR diagram'!$B$4","v":0.60718257363808881}]
[null,200,{"$f":"(C$6/'RR diagram'!$E$3)^'RR diagram'!$B$3*($B9/'RR diagram'!$E$4)^'RR diagram'!$B$4","v":0},{"$f":"(D$6/'RR diagram'!$E$3)^'RR diagram'!$B$3*($B9/'RR diagram'!$E$4)^'RR diagram'!$B$4","v":0.44256645811343609},{"$f":"(E$6/'RR diagram'!$E$3)^'RR diagram'!$B$3*($B9/'RR diagram'!$E$4)^'RR diagram'!$B$4","v":0.55631195696334368},{"$f":"(F$6/'RR diagram'!$E$3)^'RR diagram'!$B$3*($B9/'RR diagram'!$E$4)^'RR diagram'!$B$4","v":0.63595810991561086},{"$f":"(G$6/'RR diagram'!$E$3)^'RR diagram'!$B$3*($B9/'RR diagram'!$E$4)^'RR diagram'!$B$4","v":0.69929157030933475},{"$f":"(H$6/'RR diagram'!$E$3)^'RR diagram'!$B$3*($B9/'RR diagram'!$E$4)^'RR diagram'!$B$4","v":0.75272891180790935},{"$f":"(I$6/'RR diagram'!$E$3)^'RR diagram'!$B$3*($B9/'RR diagram'!$E$4)^'RR diagram'!$B$4","v":0.79940784979954582},{"$f":"(J$6/'RR diagram'!$E$3)^'RR diagram'!$B$3*($B9/'RR diagram'!$E$4)^'RR diagram'!$B$4","v":0.841125596086714},{"$f":"(K$6/'RR diagram'!$E$3)^'RR diagram'!$B$3*($B9/'RR diagram'!$E$4)^'RR diagram'!$B$4","v":0.87901885656920531},{"$f":"(L$6/'RR diagram'!$E$3)^'RR diagram'!$B$3*($B9/'RR diagram'!$E$4)^'RR diagram'!$B$4","v":0.91385759167445046},{"$f":"(M$6/'RR diagram'!$E$3)^'RR diagram'!$B$3*($B9/'RR diagram'!$E$4)^'RR diagram'!$B$4","v":0.94619030953180383}]
[null,300,{"$f":"(C$6/'RR diagram'!$E$3)^'RR diagram'!$B$3*($B10/'RR diagram'!$E$4)^'RR diagram'!$B$4","v":0},{"$f":"(D$6/'RR diagram'!$E$3)^'RR diagram'!$B$3*($B10/'RR diagram'!$E$4)^'RR diagram'!$B$4","v":0.57368950057101942},{"$f":"(E$6/'RR diagram'!$E$3)^'RR diagram'!$B$3*($B10/'RR diagram'!$E$4)^'RR diagram'!$B$4","v":0.7211353750405195},{"$f":"(F$6/'RR diagram'!$E$3)^'RR diagram'!$B$3*($B10/'RR diagram'!$E$4)^'RR diagram'!$B$4","v":0.82437899161364359},{"$f":"(G$6/'RR diagram'!$E$3)^'RR diagram'!$B$3*($B10/'RR diagram'!$E$4)^'RR diagram'!$B$4","v":0.90647681126674773},{"$f":"(H$6/'RR diagram'!$E$3)^'RR diagram'!$B$3*($B10/'RR diagram'!$E$4)^'RR diagram'!$B$4","v":0.97574650216660019},{"$f":"(I$6/'RR diagram'!$E$3)^'RR diagram'!$B$3*($B10/'RR diagram'!$E$4)^'RR diagram'!$B$4","v":1.0362554181331682},{"$f":"(J$6/'RR diagram'!$E$3)^'RR diagram'!$B$3*($B10/'RR diagram'!$E$4)^'RR diagram'!$B$4","v":1.0903332466573976},{"$f":"(K$6/'RR diagram'!$E$3)^'RR diagram'!$B$3*($B10/'RR diagram'!$E$4)^'RR diagram'!$B$4","v":1.1394534754562009},{"$f":"(L$6/'RR diagram'!$E$3)^'RR diagram'!$B$3*($B10/'RR diagram'!$E$4)^'RR diagram'!$B$4","v":1.1846141878794894},{"$f":"(M$6/'RR diagram'!$E$3)^'RR diagram'!$B$3*($B10/'RR diagram'!$E$4)^'RR diagram'!$B$4","v":1.2265264033663086}]
[null,400,{"$f":"(C$6/'RR diagram'!$E$3)^'RR diagram'!$B$3*($B11/'RR diagram'!$E$4)^'RR diagram'!$B$4","v":0},{"$f":"(D$6/'RR diagram'!$E$3)^'RR diagram'!$B$3*($B11/'RR diagram'!$E$4)^'RR diagram'!$B$4","v":0.68966421661558341},{"$f":"(E$6/'RR diagram'!$E$3)^'RR diagram'!$B$3*($B11/'RR diagram'!$E$4)^'RR diagram'!$B$4","v":0.86691714421490762},{"$f":"(F$6/'RR diagram'!$E$3)^'RR diagram'!$B$3*($B11/'RR diagram'!$E$4)^'RR diagram'!$B$4","v":0.99103206678816591},{"$f":"(G$6/'RR diagram'!$E$3)^'RR diagram'!$B$3*($B11/'RR diagram'!$E$4)^'RR diagram'!$B$4","v":1.0897264448804076},{"$f":"(H$6/'RR diagram'!$E$3)^'RR diagram'!$B$3*($B11/'RR diagram'!$E$4)^'RR diagram'!$B$4","v":1.1729994123342304},{"$f":"(I$6/'RR diagram'!$E$3)^'RR diagram'!$B$3*($B11/'RR diagram'!$E$4)^'RR diagram'!$B$4","v":1.2457405625327345},{"$f":"(J$6/'RR diagram'!$E$3)^'RR diagram'!$B$3*($B11/'RR diagram'!$E$4)^'RR diagram'!$B$4","v":1.3107505430331838},{"$f":"(K$6/'RR diagram'!$E$3)^'RR diagram'!$B$3*($B11/'RR diagram'!$E$4)^'RR diagram'!$B$4","v":1.3698007157847962},{"$f":"(L$6/'RR diagram'!$E$3)^'RR diagram'!$B$3*($B11/'RR diagram'!$E$4)^'RR diagram'!$B$4","v":1.4240909325731599},{"$f":"(M$6/'RR diagram'!$E$3)^'RR diagram'!$B$3*($B11/'RR diagram'!$E$4)^'RR diagram'!$B$4","v":1.4744759496103725}]
[null,500,{"$f":"(C$6/'RR diagram'!$E$3)^'RR diagram'!$B$3*($B12/'RR diagram'!$E$4)^'RR diagram'!$B$4","v":0},{"$f":"(D$6/'RR diagram'!$E$3)^'RR diagram'!$B$3*($B12/'RR diagram'!$E$4)^'RR diagram'!$B$4","v":0.7955364837549187},{"$f":"(E$6/'RR diagram'!$E$3)^'RR diagram'!$B$3*($B12/'RR diagram'!$E$4)^'RR diagram'!$B$4","v":1},{"$f":"(F$6/'RR diagram'!$E$3)^'RR diagram'!$B$3*($B12/'RR diagram'!$E$4)^'RR diagram'!$B$4","v":1.1431681486535354},{"$f":"(G$6/'RR diagram'!$E$3)^'RR diagram'!$B$3*($B12/'RR diagram'!$E$4)^'RR diagram'!$B$4","v":1.2570133745218284},{"$f":"(H$6/'RR diagram'!$E$3)^'RR diagram'!$B$3*($B12/'RR diagram'!$E$4)^'RR diagram'!$B$4","v":1.353069806222964},{"$f":"(I$6/'RR diagram'!$E$3)^'RR diagram'!$B$3*($B12/'RR diagram'!$E$4)^'RR diagram'!$B$4","v":1.4369776521848516},{"$f":"(J$6/'RR diagram'!$E$3)^'RR diagram'!$B$3*($B12/'RR diagram'!$E$4)^'RR diagram'!$B$4","v":1.5119674951407474},{"$f":"(K$6/'RR diagram'!$E$3)^'RR diagram'!$B$3*($B12/'RR diagram'!$E$4)^'RR diagram'!$B$4","v":1.5800826237267542},{"$f":"(L$6/'RR diagram'!$E$3)^'RR diagram'!$B$3*($B12/'RR diagram'!$E$4)^'RR diagram'!$B$4","v":1.642707082304661},{"$f":"(M$6/'RR diagram'!$E$3)^'RR diagram'!$B$3*($B12/'RR diagram'!$E$4)^'RR diagram'!$B$4","v":1.7008268430839244}]
[null,600,{"$f":"(C$6/'RR diagram'!$E$3)^'RR diagram'!$B$3*($B13/'RR diagram'!$E$4)^'RR diagram'!$B$4","v":0},{"$f":"(D$6/'RR diagram'!$E$3)^'RR diagram'!$B$3*($B13/'RR diagram'!$E$4)^'RR diagram'!$B$4","v":0.89399707713612098},{"$f":"(E$6/'RR diagram'!$E$3)^'RR diagram'!$B$3*($B13/'RR diagram'!$E$4)^'RR diagram'!$B$4","v":1.1237662827435266},{"$f":"(F$6/'RR diagram'!$E$3)^'RR diagram'!$B$3*($B13/'RR diagram'!$E$4)^'RR diagram'!$B$4","v":1.2846538209631828},{"$f":"(G$6/'RR diagram'!$E$3)^'RR diagram'!$B$3*($B13/'RR diagram'!$E$4)^'RR diagram'!$B$4","v":1.4125892472452914},{"$f":"(H$6/'RR diagram'!$E$3)^'RR diagram'!$B$3*($B13/'RR diagram'!$E$4)^'RR diagram'!$B$4","v":1.5205342264316841},{"$f":"(I$6/'RR diagram'!$E$3)^'RR diagram'!$B$3*($B13/'RR diagram'!$E$4)^'RR diagram'!$B$4","v":1.614827034581291},{"$f":"(J$6/'RR diagram'!$E$3)^'RR diagram'!$B$3*($B13/'RR diagram'!$E$4)^'RR diagram'!$B$4","v":1.6990980916433589},{"$f":"(K$6/'RR diagram'!$E$3)^'RR diagram'!$B$3*($B13/'RR diagram'!$E$4)^'RR diagram'!$B$4","v":1.7756435764930532},{"$f":"(L$6/'RR diagram'!$E$3)^'RR diagram'!$B$3*($B13/'RR diagram'!$E$4)^'RR diagram'!$B$4","v":1.8460188315179733},{"$f":"(M$6/'RR diagram'!$E$3)^'RR diagram'!$B$3*($B13/'RR diagram'!$E$4)^'RR diagram'!$B$4","v":1.9113318590428292}]
[null,700,{"$f":"(C$6/'RR diagram'!$E$3)^'RR diagram'!$B$3*($B14/'RR diagram'!$E$4)^'RR diagram'!$B$4","v":0},{"$f":"(D$6/'RR diagram'!$E$3)^'RR diagram'!$B$3*($B14/'RR diagram'!$E$4)^'RR diagram'!$B$4","v":0.98669299344036221},{"$f":"(E$6/'RR diagram'!$E$3)^'RR diagram'!$B$3*($B14/'RR diagram'!$E$4)^'RR diagram'!$B$4","v":1.2402862893015139},{"$f":"(F$6/'RR diagram'!$E$3)^'RR diagram'!$B$3*($B14/'RR diagram'!$E$4)^'RR diagram'!$B$4","v":1.4178557811411749},{"$f":"(G$6/'RR diagram'!$E$3)^'RR diagram'!$B$3*($B14/'RR diagram'!$E$4)^'RR diagram'!$B$4","v":1.5590564538880527},{"$f":"(H$6/'RR diagram'!$E$3)^'RR diagram'!$B$3*($B14/'RR diagram'!$E$4)^'RR diagram'!$B$4","v":1.6781939291261985},{"$f":"(I$6/'RR diagram'!$E$3)^'RR diagram'!$B$3*($B14/'RR diagram'!$E$4)^'RR diagram'!$B$4","v":1.7822636800375511},{"$f":"(J$6/'RR diagram'!$E$3)^'RR diagram'!$B$3*($B14/'RR diagram'!$E$4)^'RR diagram'!$B$4","v":1.8752725540926223},{"$f":"(K$6/'RR diagram'!$E$3)^'RR diagram'!$B$3*($B14/'RR diagram'!$E$4)^'RR diagram'!$B$4","v":1.9597548141718562},{"$f":"(L$6/'RR diagram'!$E$3)^'RR diagram'!$B$3*($B14/'RR diagram'!$E$4)^'RR diagram'!$B$4","v":2.0374270715209644},{"$f":"(M$6/'RR diagram'!$E$3)^'RR diagram'!$B$3*($B14/'RR diagram'!$E$4)^'RR diagram'!$B$4","v":2.1095122139529687}]
["Opp",800,{"$f":"(C$6/'RR diagram'!$E$3)^'RR diagram'!$B$3*($B15/'RR diagram'!$E$4)^'RR diagram'!$B$4","v":0},{"$f":"(D$6/'RR diagram'!$E$3)^'RR diagram'!$B$3*($B15/'RR diagram'!$E$4)^'RR diagram'!$B$4","v":1.0747238588923378},{"$f":"(E$6/'RR diagram'!$E$3)^'RR diagram'!$B$3*($B15/'RR diagram'!$E$4)^'RR diagram'!$B$4","v":1.3509422645453788},{"$f":"(F$6/'RR diagram'!$E$3)^'RR diagram'!$B$3*($B15/'RR diagram'!$E$4)^'RR diagram'!$B$4","v":1.5443541674981554},{"$f":"(G$6/'RR diagram'!$E$3)^'RR diagram'!$B$3*($B15/'RR diagram'!$E$4)^'RR diagram'!$B$4","v":1.6981524947403472},{"$f":"(H$6/'RR diagram'!$E$3)^'RR diagram'!$B$3*($B15/'RR diagram'!$E$4)^'RR diagram'!$B$4","v":1.827919188106828},{"$f":"(I$6/'RR diagram'!$E$3)^'RR diagram'!$B$3*($B15/'RR diagram'!$E$4)^'RR diagram'!$B$4","v":1.9412738435437051},{"$f":"(J$6/'RR diagram'!$E$3)^'RR diagram'!$B$3*($B15/'RR diagram'!$E$4)^'RR diagram'!$B$4","v":2.0425807918044452},{"$f":"(K$6/'RR diagram'!$E$3)^'RR diagram'!$B$3*($B15/'RR diagram'!$E$4)^'RR diagram'!$B$4","v":2.1346003978662251},{"$f":"(L$6/'RR diagram'!$E$3)^'RR diagram'!$B$3*($B15/'RR diagram'!$E$4)^'RR diagram'!$B$4","v":2.2192024257533909},{"$f":"(M$6/'RR diagram'!$E$3)^'RR diagram'!$B$3*($B15/'RR diagram'!$E$4)^'RR diagram'!$B$4","v":2.2977188669953645}]
{"$rows_left_out":8}
{"sheet":"LT 24-h paterns","index":3,"n_rows":24,"n_cols":70,"rows_kept":24,"cut":false,"hidden":false,"merged":[]}
[4,0,5,2,3,0,1,2,2,1,3,12,8,4,1,0,1,4,5,1,5,6,8,3,1,2,0,3,4,0,3,6,8,3,3,1,1,2,1,1,2,4,6,0,1,0,4,2,4,0,1,3,5,2,4,2,4,3,6,2,3,4,4,5,6,0,3,3,3,0]
[1,4,1,0,1,1,2,1,5,0,3,7,5,1,2,0,1,1,3,2,4,6,2,0,3,0,2,4,4,0,1,8,2,1,1,0,0,1,7,0,1,5,1,3,1,1,1,6,4,1,1,3,2,0,1,3,1,7,3,3,3,3,8,1,1,2,2,9,1,3]
[3,3,8,0,0,1,0,1,3,1,1,0,4,1,2,2,1,1,3,1,1,0,5,3,1,0,0,2,4,0,1,4,5,1,0,0,1,1,4,1,1,1,3,1,1,0,1,2,2,1,0,0,0,0,0,1,0,4,4,0,0,4,1,6,5,2,0,2,2,1]
[1,3,3,1,1,0,0,6,15,2,1,2,2,1,0,0,2,4,12,1,1,2,3,1,0,1,2,4,14,1,1,1,3,1,3,0,0,3,8,2,2,4,5,1,1,1,0,5,9,2,0,0,0,0,0,0,2,2,1,1,1,2,0,1,0,1,2,2,3,0]
[7,4,4,5,7,1,7,18,125,5,2,3,7,4,5,1,7,22,139,3,5,2,5,4,4,2,8,15,130,3,3,0,2,4,2,1,9,11,120,2,2,0,3,0,1,2,8,10,81,1,0,0,0,0,1,0,2,7,4,0,0,0,0,0,0,2,3,4,3,1]
[10,12,20,23,15,4,13,53,163,10,13,15,22,18,16,3,16,62,155,6,13,9,27,23,12,3,24,49,138,6,8,9,17,9,8,1,19,52,153,7,9,12,23,17,9,4,12,47,138,6,1,7,6,1,8,0,2,12,16,7,0,0,0,0,0,0,4,5,18,2]
[15,44,72,86,46,8,42,167,304,52,21,53,89,99,51,11,46,177,331,46,17,46,82,102,45,5,41,172,295,45,20,49,77,101,57,7,48,156,296,48,20,37,67,77,57,7,35,140,278,21,4,14,12,5,13,1,7,10,19,1,2,5,2,0,8,1,8,10,16,1]
[38,78,110,212,105,20,38,125,361,23,43,82,128,222,113,23,42,133,375,21,38,80,138,208,128,24,45,124,337,34,36,77,129,207,118,20,43,149,333,30,38,75,116,187,105,24,40,121,327,26,10,12,16,8,25,4,8,18,34,6,7,8,11,5,24,4,14,14,34,4]
[41,73,145,167,98,28,41,89,198,20,36,85,148,165,101,30,41,83,199,13,39,92,164,179,99,20,36,84,183,29,43,70,121,159,89,19,45,84,181,19,37,67,119,129,94,19,45,84,156,25,19,21,56,13,40,5,23,42,48,23,7,12,21,4,29,25,21,23,94,4]
[35,61,122,64,85,26,33,74,105,15,30,60,119,66,87,23,32,69,112,19,30,68,128,68,95,14,35,65,121,15,35,60,119,56,97,21,36,82,126,14,34,60,117,62,80,18,43,75,99,16,16,34,80,27,45,9,45,36,59,28,5,18,40,12,75,22,25,29,73,5]
[45,62,138,50,68,15,45,111,145,13,33,57,111,41,67,14,45,78,160,15,37,72,112,54,74,18,46,89,122,14,40,63,125,39,57,20,40,90,136,12,39,63,119,41,64,15,55,126,163,35,29,51,99,35,42,15,50,48,66,19,23,21,55,17,38,33,32,41,68,2]
[90,83,166,71,84,26,60,91,177,15,66,86,189,87,98,26,54,95,178,22,91,87,183,87,118,23,63,100,200,31,73,84,173,79,99,24,68,85,183,33,84,89,156,99,115,27,60,98,181,33,26,50,98,50,35,18,31,40,67,29,17,28,103,41,60,22,24,42,38,15]
[86,109,175,124,102,19,51,81,174,32,79,103,186,137,100,30,57,96,180,16,67,113,217,122,102,23,40,91,197,23,54,78,140,111,86,17,60,88,187,23,94,118,195,124,108,31,56,103,163,13,36,46,97,59,50,12,36,48,77,26,22,43,78,36,32,21,30,34,59,24]
[38,96,174,74,92,13,54,114,134,13,53,98,155,82,70,14,50,153,136,23,62,108,165,88,70,15,52,108,130,35,57,107,167,72,83,17,44,124,145,21,84,117,143,95,90,15,56,128,121,20,38,44,105,52,45,17,32,43,82,15,23,54,106,36,61,17,26,38,58,17]
[54,92,156,68,70,27,50,135,144,26,61,93,140,64,68,26,52,134,134,22,45,103,144,59,83,16,63,131,156,26,22,27,39,17,30,22,51,136,117,23,64,110,152,61,75,24,57,164,133,20,27,46,101,51,31,13,33,37,68,21,26,57,80,38,39,15,30,43,76,14]
{"$rows_left_out":10}
{"sheet":"TH 24-h paterns","index":4,"n_rows":24,"n_cols":63,"rows_kept":24,"cut":false,"hidden":false,"merged":[]}
[5,14,56,65,56,49,8,24,30,8,20,77,80,102,76,15,57,43,8,14,87,81,94,63,8,55,40,10,12,81,64,83,66,12,57,40,5,13,28,45,28,79,8,74,60,5,4,61,62,59,103,12,75,95,20,15,77,106,74,77,4,42,72]
[6,10,22,42,25,27,2,16,31,7,9,60,48,66,42,2,56,31,8,5,52,56,60,42,9,55,25,6,7,45,40,42,38,3,65,27,6,10,47,52,56,55,6,59,38,4,4,13,23,21,83,6,34,59,9,11,50,91,49,56,5,47,76]
[7,12,19,37,21,27,4,22,27,6,4,58,35,58,23,4,25,28,2,5,58,26,57,19,5,16,34,3,5,49,18,64,18,3,19,33,0,4,21,23,24,30,3,31,30,0,0,0,0,0,43,5,36,46,7,11,40,72,43,63,3,20,28]
[5,8,23,31,26,21,20,49,106,2,7,29,30,28,23,18,49,106,1,10,27,35,21,29,18,47,87,4,12,30,27,18,30,14,47,102,6,10,34,31,31,22,14,41,76,0,0,0,0,0,39,3,35,29,1,1,8,5,9,25,6,17,33]
[4,10,77,119,73,97,65,190,353,5,7,74,117,58,97,67,181,362,4,10,67,102,60,84,72,180,375,2,4,48,63,35,91,60,197,360,1,1,6,21,5,55,61,178,317,2,0,4,4,2,28,12,55,93,0,0,0,0,0,27,13,34,55]
[28,19,359,313,317,281,153,788,776,22,28,379,299,326,279,162,846,796,20,36,364,315,307,307,160,1092,771,10,25,223,201,204,278,151,800,777,15,40,298,274,263,261,142,710,776,4,8,63,73,61,76,47,164,131,0,0,0,0,0,47,28,77,129]
[60,85,1155,606,988,627,351,1719,1415,67,98,1198,584,1043,631,351,1719,1522,169,89,1310,554,1256,616,348,1984,1413,64,92,1121,569,992,624,347,1727,1458,60,71,1009,568,874,612,322,1605,1322,15,14,175,128,165,109,59,257,241,5,3,70,74,55,118,33,142,145]
[197,230,2287,1148,2220,1135,308,1570,1452,211,240,2332,1207,2256,1225,301,1717,1553,280,241,2436,1201,2475,1169,284,1711,1447,204,242,2281,1171,2178,1179,301,1553,1481,163,195,2098,1054,2022,1076,270,1315,1347,32,40,280,280,259,224,94,347,400,16,14,205,163,164,127,78,212,241]
[180,179,2025,1154,1920,1121,244,837,965,188,177,2145,1184,2094,1160,246,942,969,191,201,2146,1095,2053,1082,253,885,1063,175,190,2018,1124,1911,1144,234,891,985,129,175,1733,1077,1643,1040,247,894,939,50,62,431,441,359,356,122,470,493,26,43,309,262,272,194,103,298,321]
[109,170,1121,883,1007,753,238,625,835,81,157,1216,867,1101,790,242,711,769,124,149,1107,881,1047,842,228,668,816,110,152,1136,875,1017,789,222,724,838,113,158,1065,869,1026,792,232,788,870,55,75,544,614,496,469,132,550,576,37,52,485,415,382,282,137,364,420]
[108,133,806,878,706,747,351,758,958,119,122,873,796,794,726,320,780,993,133,135,821,857,763,741,368,824,969,127,136,877,877,839,751,392,834,992,122,149,912,942,818,787,424,843,1085,86,139,630,730,600,552,164,593,714,39,82,505,509,479,389,201,495,498]
[224,192,969,1039,849,862,327,974,1001,234,209,1009,1088,876,941,334,973,1046,222,204,1118,1119,896,976,346,971,1170,221,222,1111,1142,895,994,331,944,1055,213,208,1055,1152,928,1064,387,1199,1247,83,135,719,797,622,656,164,603,742,62,94,574,724,524,506,180,519,612]
[210,272,1171,1195,1043,965,293,917,1032,219,270,1086,1170,1030,964,299,854,958,217,276,1143,1280,1053,1125,302,942,1003,190,209,879,949,772,1020,294,949,1005,322,257,1232,1437,1220,1180,284,1133,1073,75,112,760,889,659,727,151,614,695,61,116,616,823,537,619,139,627,618]
[135,222,996,1118,996,930,360,943,1088,175,212,954,1141,924,869,366,964,1063,165,245,1067,1194,1036,915,385,1089,1026,171,228,1021,1175,1002,890,381,994,1020,242,235,1115,1287,1162,978,346,1092,1130,75,138,741,787,673,654,147,649,707,84,113,716,807,669,567,135,566,657]
[180,191,1038,1297,1061,1042,403,1316,1281,175,198,1070,1356,1056,1031,432,1436,1236,165,178,1121,1274,1133,982,433,1367,1320,55,61,258,323,253,1000,425,1323,1377,147,168,1182,1414,1114,1051,454,1352,1394,90,124,760,845,678,664,138,547,629,84,117,667,791,603,604,145,512,586]
{"$rows_left_out":9}